xfs
[Top] [All Lists]

clean install of sgi/xfs/redhat 7.1 and rernel mods won't compile

To: <linux-xfs@xxxxxxxxxxx>
Subject: clean install of sgi/xfs/redhat 7.1 and rernel mods won't compile
From: "Steve Wray" <steve.wray@xxxxxxxxxx>
Date: Fri, 11 May 2001 11:19:41 +1200
Importance: Normal
Sender: owner-linux-xfs@xxxxxxxxxxx
 
-----BEGIN PGP SIGNED MESSAGE-----
Hash: SHA1

Ok,
After installing from the SGI CD (from the image I d/l'd),
and making sure I'd picked the "kernel development"
packages,
make xconfig, selecting options, quit and save,
then make dep clean bzImage modules
gets to modules and chokes on:

(NOTE: I did not edit the toplevel Makefile or *anything*; this is
out of the box and by the book (as near as I can tell).

cd /usr/src/linux/
make modules
make -C  kernel CFLAGS="-D__KERNEL__ -I/usr/src/linux/include -Wall
- -Wstrict-prototypes -O2 -fomit-frame-pointer -fno-strict-aliasing
- -Wno-unused -pipe  -march=i586 -DMODULE -DMODVERSIONS -include
/usr/src/linux/include/linux/modversions.h" MAKING_MODULES=1 modules
make[1]: Entering directory `/usr/src/linux-2.4.2/kernel'
make[1]: Nothing to be done for `modules'.
make[1]: Leaving directory `/usr/src/linux-2.4.2/kernel'
make -C  drivers CFLAGS="-D__KERNEL__ -I/usr/src/linux/include -Wall
- -Wstrict-prototypes -O2 -fomit-frame-pointer -fno-strict-aliasing
- -Wno-unused -pipe  -march=i586 -DMODULE -DMODVERSIONS -include
/usr/src/linux/include/linux/modversions.h" MAKING_MODULES=1 modules
make[1]: Entering directory `/usr/src/linux-2.4.2/drivers'
make -C block modules
make[2]: Entering directory `/usr/src/linux-2.4.2/drivers/block'
kgcc  -D__KERNEL__ -I/usr/src/linux/include -Wall -Wstrict-prototypes
- -O2 -fomit-frame-pointer -fno-strict-aliasing -Wno-unused -pipe 
- -march=i586 -DMODULE -DMODVERSIONS -include
/usr/src/linux/include/linux/modversions.h   -c -o floppy.o floppy.c
In file included from floppy.c:137:
/usr/src/linux/include/linux/module.h:173: nondigits in number and
not hexadecimal
/usr/src/linux/include/linux/module.h:173: nondigits in number and
not hexadecimal
/usr/src/linux/include/linux/module.h:173: nondigits in number and
not hexadecimal
/usr/src/linux/include/linux/module.h:173: nondigits in number and
not hexadecimal
/usr/src/linux/include/linux/module.h:173: parse error before
`62dada05'
/usr/src/linux/include/linux/module.h:173:
`inter_module_register_R_ver_str' declared as function returning a
function
/usr/src/linux/include/linux/module.h:173: warning: function
declaration isn't a prototype
/usr/src/linux/include/linux/module.h:174: nondigits in number and
not hexadecimal
/usr/src/linux/include/linux/module.h:174: missing white space after
number `7a9e845'
/usr/src/linux/include/linux/module.h:174: parse error before
`7a9e845'
/usr/src/linux/include/linux/module.h:174:
`inter_module_unregister_R_ver_str' declared as function returning a
function
/usr/src/linux/include/linux/module.h:174: warning: function
declaration isn't a prototype
/usr/src/linux/include/linux/module.h:175:
`inter_module_get_R_ver_str' declared as function returning a
function
/usr/src/linux/include/linux/module.h:175: warning: parameter names
(without types) in function declaration
/usr/src/linux/include/linux/module.h:176:
`inter_module_get_request_R_ver_str' declared as function returning a
function
/usr/src/linux/include/linux/module.h:176: warning: parameter names
(without types) in function declaration
/usr/src/linux/include/linux/module.h:177: nondigits in number and
not hexadecimal
/usr/src/linux/include/linux/module.h:177: nondigits in number and
not hexadecimal
/usr/src/linux/include/linux/module.h:177: nondigits in number and
not hexadecimal
/usr/src/linux/include/linux/module.h:177: parse error before
`6b99f7d8'
/usr/src/linux/include/linux/module.h:177:
`inter_module_put_R_ver_str' declared as function returning a
function
/usr/src/linux/include/linux/module.h:177: warning: function
declaration isn't a prototype
/usr/src/linux/include/linux/module.h:186:
`try_inc_mod_count_R_ver_str' declared as function returning a
function
/usr/src/linux/include/linux/module.h:186: warning: parameter names
(without types) in function declaration
make[2]: *** [floppy.o] Error 1
make[2]: Leaving directory `/usr/src/linux-2.4.2/drivers/block'
make[1]: *** [_modsubdir_block] Error 2
make[1]: Leaving directory `/usr/src/linux-2.4.2/drivers'
make: *** [_mod_drivers] Error 2

Compilation exited abnormally with code 2 at Fri May 11 11:18:42

-----BEGIN PGP SIGNATURE-----
Version: PGPfreeware 7.0.3 for non-commercial use <http://www.pgp.com>

iQA+AwUBOvsiDAhKySqSS+rVEQL3HwCXYtvO92jj13vZc03bvreGXRZ8RQCgzDhJ
3Ch+UeMWshOJr2WWihtE1Gc=
=oZHo
-----END PGP SIGNATURE-----


<Prev in Thread] Current Thread [Next in Thread>